*KEYWORD
*CONTROL_TERMINATION
*DATABASE_BINARY_D3PLOT
*MAT_ELASTIC
*SECTION_BEAM
*PART
beam
*NODE
*ELEMENT_BEAM
*BOUNDARY_PRESCRIBED_MOTION_NODE
*DEFINE_CURVE
*BOUNDARY_SPC_NODE
*END