*KEYWORD
*CONTROL_TERMINATION
*DATABASE_BINARY_D3PLOT
*DATABASE_ELOUT
*DATABASE_NODOUT
*DATABASE_HISTORY_BEAM
*DATABASE_HISTORY_NODE
*MAT_ELASTIC
*MAT_LINEAR_ELASTIC_DISCRETE_BEAM
*SECTION_BEAM
*SECTION_BEAM
*PART
beam
*NODE
*ELEMENT_BEAM
*BOUNDARY_PRESCRIBED_MOTION_NODE
*DEFINE_CURVE
*DEFINE_COORDINATE_NODES
*BOUNDARY_SPC_NODE
*END