*KEYWORD
$
$
$ =============
$ CONTROL cards
$ =============
$
*CONTROL_BULK_VISCOSITY
*CONTROL_TERMINATION
*CONTROL_TIMESTEP
$
$
$ ====================
$ MAT (Material) cards
$ ====================
$
*MAT_ELASTIC
$
$
$
$ =============
$ SECTION cards
$ =============
$
*SECTION_SHELL
$
*SECTION_SOLID
$
$
$
$ ==========
$ PART cards
$ ==========
$
*PART
Impacted Material (Shell)
$
*PART
Impactor Material (Solid)
$
$
$
$ ==========
$ NODE cards
$ ==========
$
*NODE
$
$
$ =============
$ ELEMENT cards
$ =============
$
*ELEMENT_SHELL
*ELEMENT_SOLID
$
*END