*KEYWORD
$-----------------------------------------------------------------------------
$
$ Example provided by DYNAmore
$
$ DYNAmore GmbH
$ Industriestr. 2
$ 70565 Stuttgart
$ Germany
$ Tel: +49-(0)711-459-6000
$ LS-DYNA Hotline: +49-(0)7031-418295
$
$ E-Mail: info@dynamore.de
$ Web: http://www.dynamore.de
$
$ Copyright, 2012 DYNAmore GmbH
$ Copying for non-commercial usage allowed if
$ copy bears this notice completely.
$
$------------------------------------------------------------------------------
$
$
$ =============
$ CONTROL cards
$ =============
$
*CONTROL_TERMINATION
$:  endtim    endcyc     dtmin    endeng    endmas     nosol
*CONTROL_TIMESTEP
$:  dtinit    tssfac      isdo    tslimt     dt2ms      lctm     erode     ms1st
$
$
$ ==============
$ DATABASE cards
$ ==============
$
*DATABASE_BINARY_D3PLOT
$:      dt      lcdt    nobeam     npltc    psetid
$
$
$ ====================
$ MAT (Material) cards
$ ====================
$
*MAT_ELASTIC
$:     mid        ro         e        pr        da        db         k
$
$
$ =============
$ SECTION cards
$ =============
$
*SECTION_SHELL
$:   label    elform      shrf       nip     propt        qr     icomp     setyp
$:      t1        t2        t3        t4      nloc     marea      idof    edgset
$
$
$ ==========
$ PART cards
$ ==========
$
*PART
Impacted Material
$:     pid     secid       mid     eosid      hgid      grav    adpopt      tmid
$
*PART
Impactor Material
$:     pid     secid       mid     eosid      hgid      grav    adpopt      tmid
$
$
$ ==========
$ NODE cards
$ ==========
$
*NODE
$:   nid              cx              cy              cz      tc      rc
$
$
$ =============
$ ELEMENT cards
$ =============
$
*ELEMENT_SHELL
$: label     pid      n1      n2      n3      n4      n5      n6      n7      n8
$
$
$ ============
$ DEFINE cards
$ ============
$
*DEFINE_CURVE
$:   label      sidr       sfa       sfo      offa      offo    dattyp
$:             xvals               yvals
$
$
$ ==============
$ BOUNDARY cards
$ ==============
$
$*BOUNDARY_PRESCRIBED_MOTION_SET
$:      id       dof       vad      lcid        sf       vid     death     birth
$         1         3         2         1       0.0         0       0.0       0.0
$         2         3         2         1       0.0         0       0.0       0.0
$
*SET_NODE_LIST
$:     sid       da1       da2       da3       da4
$:     id1       id2       id3       id4       id5       id6       id7       id8
$
*SET_NODE_LIST
$:     sid       da1       da2       da3       da4
$:     id1       id2       id3       id4       id5       id6       id7       id8
$
*BOUNDARY_SPC_NODE
$:      id       cid      dofx      dofy      dofz     dofrx     dofry     dofrz
$
$
$ =============
$ CONTACT cards
$ =============
$
*CONTACT_TIED_SHELL_EDGE_TO_SURFACE
$:    ssid      msid     sstyp     mstyp    sboxid    mboxid       spr       mpr
$:      fs        fd        dc        vc       vdc    penchk        bt        dt
$:     sfs       sfm       sst       mst      sfst      sfmt       fsf       vsf
$
$
*END